Elmer/Ice test cases

Extension of Elmer in computational glaciology

Elmer/Ice test cases

Postby rgladstone » 26 Nov 2014, 09:15

Hi all, I am currently running the test cases, which I haven't done before, and I notice some failures, albeit by fairly small margins. Do these look worrying to you?

Cheers,
Rupert

Code: Select all
=============================================================
                    Test ElmerIce Solvers                   

Option []: All tests without email option
=============================================================

test 1 :                  Buoyancy       [PASSED]
test 2 :          ComputeDevStress       [PASSED]
test 3 :                   Contact       [PASSED]
test 4 :                    Dating       [PASSED]
test 5 :                   Density       [PASSED]
test 6 :                  DGsolver       [PASSED - Diff Time-]
test 7 :               EigenValues       [PASSED]
test 8 :                  Enthalpy       [PASSED]
test 9 :          ExportVertically       [PASSED]
test 10 :                 FlowDepth       [PASSED - Diff Time-]
test 11 :                FlowHeight       [PASSED - Diff Time-]
test 12 :             ForceToStress       [PASSED]
test 13 :              FrictionHeat       [PASSED]
test 14 :                   Glen_2D       [PASSED - Diff Time-]
test 15 :                 GL_MISMIP       [PASSED]
test 16 :        Grid2DInterpolator       [PASSED - Diff Time-]
test 17 :                  Grounded       [PASSED]
test 18 :             Hydro_Coupled       [PASSED]
test 19 :             Hydro_SedOnly       [PASSED]
test 20 :        IntegratedVelocity       [PASSED]
test 21 :       IntegrateVertically       [PASSED]
test 22 :           InvMeth_AdjBeta               [FAILED]
Differences in results: look at [File_log/Output_InvMeth_AdjBeta.log] for details
For variable [ NRM: velocity]:  Found result [0.331326202393E+03] - Expected result [0.330924285889E+03]
test 23 :             InvMeth_AdjMu               [FAILED]
Differences in results: look at [File_log/Output_InvMeth_AdjMu.log] for details
For variable [ NRM: velocity]:  Found result [0.330836975098E+03] - Expected result [0.330443420410E+03]
test 24 :          InvMeth_AdjRobin               [FAILED]
Differences in results: look at [File_log/Output_InvMeth_AdjRobin.log] for details
For variable [ NRM: velocity]:  Found result [0.331694824219E+03] - Expected result [0.331291992188E+03]
test 25 :           LateralFriction       [PASSED]
test 26 :                    Porous               [FAILED]
Differences in results: look at [File_log/Output_Porous.log] for details
For variable [ max: strainrate 1]:  Found result [0.209412397817E-02] - Expected result [0.212603458203E-02]
test 27 :               ShapeFactor       [PASSED]
test 28 :                       SIA       [PASSED - Diff Time-]
test 29 :               SSA_Coulomb       [PASSED]
test 30 :              SSA_IceSheet       [PASSED]
test 31 :              SSA_Weertman       [PASSED]
test 32 :              Teterousse3a               [FAILED]
Differences in results: look at [File_log/Output_Teterousse3a.log] for details
For variable [ max: pressure]:  Found result [0.744173765182E+00] - Expected result [0.744167804718E+00]
test 33 :            Teterousse3a_b               [FAILED]
Differences in results: look at [File_log/Output_Teterousse3a_b.log] for details
For variable [ convective flux:  over bc 3]:  Found result [-0.312775761719E+05] - Expected result [-0.312769257812E+05]
test 34 :     Teterousse_DeformHeat               [FAILED]
Differences in results: look at [File_log/Output_Teterousse_DeformHeat.log] for details
For variable [ max: w]:  Found result [0.219553932548E+00] - Expected result [0.219552010298E+00]
test 35 :           ThicknessSolver       [PASSED]

Tests completed, passed: 28 out of total 35 tests
rgladstone
 
Posts: 55
Joined: 15 Apr 2013, 16:23

Re: Elmer/Ice test cases

Postby Evan » 13 Jan 2015, 15:48

Hi,

Cheng Gong and I have been trying to run the Elmer/Ice test cases as well. Pretty much failing in the same spots, with the same errors. I have version 6874 on my computer, while Cheng Gong has something closer to the latest version (7098). We both had failures on the same tests (I assume the last test failed because I am missing something in my environment paths).

Cheers,
Evan

Code: Select all
=============================================================
                    Test ElmerIce Solvers                   

Option []: All tests without email option
=============================================================

Warning: Nonexistent include directory "binio"
Warning: Nonexistent include directory "../binio"
Warning: Nonexistent include directory "/usr/local/ElmerRev6874//share/elmersolver/lib/binio"
test 1 :                  Buoyancy       [PASSED]
test 2 :          ComputeDevStress       [PASSED]
test 3 :                   Contact       [PASSED]
test 4 :                    Dating       [PASSED]
test 5 :                   Density       [PASSED]
test 6 :                  DGsolver       [PASSED]
test 7 :               EigenValues       [PASSED]
test 8 :                  Enthalpy       [PASSED]
test 9 :          ExportVertically       [PASSED]
test 10 :                 FlowDepth       [PASSED]
test 11 :                FlowHeight       [PASSED]
test 12 :             ForceToStress       [PASSED]
test 13 :              FrictionHeat       [PASSED]
test 14 :                   Glen_2D       [PASSED]
test 15 :        Grid2DInterpolator       [PASSED]
test 16 :                  Grounded       [PASSED]
test 17 :             Hydro_Coupled       [PASSED]
test 18 :             Hydro_SedOnly       [PASSED]
test 19 :        IntegratedVelocity       [PASSED]
test 20 :       IntegrateVertically       [PASSED]
test 21 :           InvMeth_AdjBeta               [FAILED]
Differences in results: look at [File_log/Output_InvMeth_AdjBeta.log] for details
For variable [ NRM: velocity]:  Found result [0.331326202393E+03] - Expected result [0.330924285889E+03]
test 22 :             InvMeth_AdjMu               [FAILED]
Differences in results: look at [File_log/Output_InvMeth_AdjMu.log] for details
For variable [ NRM: velocity]:  Found result [0.330836975098E+03] - Expected result [0.330443420410E+03]
test 23 :          InvMeth_AdjRobin               [FAILED]
Differences in results: look at [File_log/Output_InvMeth_AdjRobin.log] for details
For variable [ NRM: velocity]:  Found result [0.331694824219E+03] - Expected result [0.331291992188E+03]
test 24 :           LateralFriction       [PASSED]
test 25 :                    Porous               [FAILED]
Differences in results: look at [File_log/Output_Porous.log] for details
For variable [ max: strainrate 1]:  Found result [0.215263408609E-02] - Expected result [0.212603458203E-02]
test 26 :               ShapeFactor       [PASSED]
test 27 :                       SIA       [PASSED]
test 28 :               SSA_Coulomb       [PASSED]
test 29 :              SSA_IceSheet       [PASSED]
test 30 :              SSA_Weertman       [PASSED]
test 31 :              Teterousse3a               [FAILED]
Differences in results: look at [File_log/Output_Teterousse3a.log] for details
For variable [ max: pressure]:  Found result [0.744173765182E+00] - Expected result [0.744167804718E+00]
test 32 :            Teterousse3a_b               [FAILED]
Differences in results: look at [File_log/Output_Teterousse3a_b.log] for details
For variable [ convective flux: flow solution over bc 3]:  Found result [-0.312775761719E+05] - Expected result [-0.312769257812E+05]
test 33 :     Teterousse_DeformHeat               [FAILED]
Differences in results: look at [File_log/Output_Teterousse_DeformHeat.log] for details
For variable [ max: w]:  Found result [0.219553932548E+00] - Expected result [0.219552010298E+00]
test 34 :           ThicknessSolver *** Error in `/usr/local/ElmerRev6874//bin/ElmerSolver': free(): invalid pointer: 0x00000000024797d0 ***
      [PASSED]

Tests completed, passed: 27 out of total 34 tests
Evan
 
Posts: 12
Joined: 12 Aug 2014, 14:42


Return to Elmer/Ice

Who is online

Users browsing this forum: No registered users and 1 guest